BDBM388297 US10294230, Compound E1-9.2
SMILES Cc1ccc(COC(=O)N2CC[C@@H](CNc3nc4ccccn4n3)C(F)(F)C2)cc1
InChI Key InChIKey=OUCYNWHQWAGIGA-KRWDZBQOSA-N
Data  4 IC50
  Tab Delimited (TSV)   2D SDfile   Computed 3D by Vconf -m prep SDfile
Find this compound or compounds like it in BindingDB:
Activity Spreadsheet -- Enzyme Inhibition Constant Data from BindingDB
Found 4 hits for monomerid = 388297
TargetGlutamate receptor ionotropic, NMDA 2B(Homo sapiens (Human))
Rugen Holdings (Cayman)
US Patent
LigandPNGBDBM388297(US10294230, Compound E1-9.2)
Affinity DataIC50:  48.2nM. Assay description: HEK293 cell lines stably expressing cloned human NR1/NR2B and NR1/NR2A, respectively, were established according to standard previously described met...
Ligand InfoPC cidPC sid
In DepthDetails US Patent
TargetGlutamate receptor ionotropic, NMDA 2B(Homo sapiens (Human))
Rugen Holdings (Cayman)
US Patent
LigandPNGBDBM388297(US10294230, Compound E1-9.2)
Affinity DataIC50:  48.2nM. Assay description: HEK293 cell lines stably expressing cloned human NR1/NR2B and NR1/NR2A, respectively, were established according to standard previously described met...
Ligand InfoPC cidPC sid
In DepthDetails US Patent
TargetGlutamate receptor ionotropic, NMDA 2B(Homo sapiens (Human))
Rugen Holdings (Cayman)
US Patent
LigandPNGBDBM388297(US10294230, Compound E1-9.2)
Affinity DataIC50:  48.2nM. Assay description: HEK293 cell lines stably expressing cloned human NR1/NR2B and NR1/NR2A, respectively, were established according to standard previously described met...
Ligand InfoPC cidPC sid
In DepthDetails US Patent
TargetGlutamate receptor ionotropic, NMDA 2A(Homo sapiens (Human))
Rugen Holdings (Cayman)
US Patent
LigandPNGBDBM388297(US10294230, Compound E1-9.2)
Affinity DataIC50: >1.00E+7nM. Assay description: HEK293 cell lines stably expressing cloned human NR1/NR2B and NR1/NR2A, respectively, were established according to standard previously described met...
Ligand InfoPC cidPC sid
In DepthDetails US Patent