BDBM388302 US10294230, Compound E1-21.2::US10584127, Compound E1-21.2::US11136328, Compound E1-21.2::US11752155, Compound E1-21.2B'
SMILES Cc1ccc(COC(=O)N2CC[C@H](CNc3cnccn3)C(F)(F)C2)cc1
InChI Key InChIKey=BJPZPKJQXJYVLY-MRXNPFEDSA-N
Data  1 KI  14 IC50
  Tab Delimited (TSV)   2D SDfile   Computed 3D by Vconf -m prep SDfile
Find this compound or compounds like it in BindingDB:
Activity Spreadsheet -- Enzyme Inhibition Constant Data from BindingDB
Found 15 hits for monomerid = 388302
TargetGlutamate receptor ionotropic, NMDA 2B(Rattus norvegicus (Rat))
Rugen Holdings (Cayman)
US Patent
LigandPNGBDBM388302(US10294230, Compound E1-21.2 | US10584127, Compoun...)
Affinity DataKi:  0.716nM. Assay description: HEK293 cell lines stably expressing cloned human NR1/NR2B and NR1/NR2A, respectively, were established according to standard previously described met...
Ligand InfoPC cidPC sid
In DepthDetails US Patent
TargetGlutamate receptor ionotropic, NMDA 2B(Homo sapiens (Human))
Rugen Holdings (Cayman)
US Patent
LigandPNGBDBM388302(US10294230, Compound E1-21.2 | US10584127, Compoun...)
Affinity DataIC50:  13.9nM. Assay description: HEK293 cell lines stably expressing cloned human NR1/NR2B and NR1/NR2A, respectively, were established according to standard previously described met...
Ligand InfoPC cidPC sid
In DepthDetails US Patent
TargetGlutamate receptor ionotropic, NMDA 2B(Homo sapiens (Human))
Rugen Holdings (Cayman)
US Patent
LigandPNGBDBM388302(US10294230, Compound E1-21.2 | US10584127, Compoun...)
Affinity DataIC50:  14.4nM. Assay description: HEK293 cell lines stably expressing cloned human NR1/NR2B and NR1/NR2A, respectively, were established according to standard previously described met...
Ligand InfoPC cidPC sid
In DepthDetails US Patent
TargetGlutamate receptor ionotropic, NMDA 2B(Homo sapiens (Human))
Rugen Holdings (Cayman)
US Patent
LigandPNGBDBM388302(US10294230, Compound E1-21.2 | US10584127, Compoun...)
Affinity DataIC50:  14.4nM. Assay description: HEK293 cell lines stably expressing cloned human NR1/NR2B and NR1/NR2A, respectively, were established according to standard previously described met...
Ligand InfoPC cidPC sid
In DepthDetails US Patent
TargetGlutamate receptor ionotropic, NMDA 2B(Homo sapiens (Human))
Rugen Holdings (Cayman)
US Patent
LigandPNGBDBM388302(US10294230, Compound E1-21.2 | US10584127, Compoun...)
Affinity DataIC50:  14.4nM. Assay description: HEK293 cell lines stably expressing cloned human NR1/NR2B and NR1/NR2A, respectively, were established according to standard previously described met...
Ligand InfoPC cidPC sid
In DepthDetails US Patent
TargetGlutamate receptor ionotropic, NMDA 2A(Homo sapiens (Human))
Rugen Holdings (Cayman)
US Patent
LigandPNGBDBM388302(US10294230, Compound E1-21.2 | US10584127, Compoun...)
Affinity DataIC50: >1.00E+7nM. Assay description: HEK293 cell lines stably expressing cloned human NR1/NR2B and NR1/NR2A, respectively, were established according to standard previously described met...
Ligand InfoPC cidPC sid
In DepthDetails US Patent
TargetGlutamate receptor ionotropic, NMDA 2B(Homo sapiens (Human))
Rugen Holdings (Cayman)
US Patent
LigandPNGBDBM388302(US10294230, Compound E1-21.2 | US10584127, Compoun...)
Affinity DataIC50:  14.4nM. Assay description: HEK293 cell lines stably expressing cloned human NR1/NR2B and NR1/NR2A, respectively, were established according to standard previously described met...
Ligand InfoPC cidPC sid
In DepthDetails US Patent
TargetGlutamate receptor ionotropic, NMDA 2A(Homo sapiens (Human))
Rugen Holdings (Cayman)
US Patent
LigandPNGBDBM388302(US10294230, Compound E1-21.2 | US10584127, Compoun...)
Affinity DataIC50: >1.00E+4nM. Assay description: HEK293 cell lines stably expressing cloned human NR1/NR2B and NR1/NR2A, respectively, were established according to standard previously described met...
Ligand InfoPC cidPC sid
In DepthDetails US Patent
TargetGlutamate receptor ionotropic, NMDA 2B(Homo sapiens (Human))
Rugen Holdings (Cayman)
US Patent
LigandPNGBDBM388302(US10294230, Compound E1-21.2 | US10584127, Compoun...)
Affinity DataIC50:  14.4nM. Assay description: HEK293 cell lines stably expressing cloned human NR1/NR2B and NR1/NR2A, respectively, were established according to standard previously described met...
Ligand InfoPC cidPC sid
In DepthDetails US Patent
TargetGlutamate receptor ionotropic, NMDA 2B(Homo sapiens (Human))
Rugen Holdings (Cayman)
US Patent
LigandPNGBDBM388302(US10294230, Compound E1-21.2 | US10584127, Compoun...)
Affinity DataIC50:  14.4nM. Assay description: HEK293 cell lines stably expressing cloned human NR1/NR2B and NR1/NR2A, respectively, were established according to standard previously described met...
Ligand InfoPC cidPC sid
In DepthDetails US Patent
TargetGlutamate receptor ionotropic, NMDA 2B(Homo sapiens (Human))
Rugen Holdings (Cayman)
US Patent
LigandPNGBDBM388302(US10294230, Compound E1-21.2 | US10584127, Compoun...)
Affinity DataIC50:  13.9nM. Assay description: HEK293 cell lines stably expressing cloned human NR1/NR2B and NR1/NR2A, respectively, were established according to standard previously described met...
Ligand InfoPC cidPC sid
In DepthDetails US Patent
TargetGlutamate receptor ionotropic, NMDA 2B(Homo sapiens (Human))
Rugen Holdings (Cayman)
US Patent
LigandPNGBDBM388302(US10294230, Compound E1-21.2 | US10584127, Compoun...)
Affinity DataIC50:  13.9nM. Assay description: HEK293 cell lines stably expressing cloned human NR1/NR2B and NR1/NR2A, respectively, were established according to standard previously described met...
Ligand InfoPC cidPC sid
In DepthDetails US Patent
TargetGlutamate receptor ionotropic, NMDA 2A(Homo sapiens (Human))
Rugen Holdings (Cayman)
US Patent
LigandPNGBDBM388302(US10294230, Compound E1-21.2 | US10584127, Compoun...)
Affinity DataIC50: >1.00E+7nM. Assay description: This example describes an NR2B receptor binding assay in rat brain using [3H] (E)-N1-(2-methoxybenzyl)-cinnamidine (see below). The binding assay met...
Ligand InfoPC cidPC sid
In DepthDetails US Patent
TargetGlutamate receptor ionotropic, NMDA 2B(Homo sapiens (Human))
Rugen Holdings (Cayman)
US Patent
LigandPNGBDBM388302(US10294230, Compound E1-21.2 | US10584127, Compoun...)
Affinity DataIC50:  14.4nM. Assay description: HEK293 cell lines stably expressing cloned human NR1/NR2B and NR1/NR2A, respectively, were established according to standard previously described met...
Ligand InfoPC cidPC sid
In DepthDetails US Patent
TargetGlutamate receptor ionotropic, NMDA 2A(Homo sapiens (Human))
Rugen Holdings (Cayman)
US Patent
LigandPNGBDBM388302(US10294230, Compound E1-21.2 | US10584127, Compoun...)
Affinity DataIC50: >1.00E+7nM. Assay description: HEK293 cell lines stably expressing cloned human NR1/NR2B and NR1/NR2A, respectively, were established according to standard previously described met...
Ligand InfoPC cidPC sid
In DepthDetails US Patent