BDBM388444 6-cyclopropyl-N- (trans-4- morpholin-4- ylcyclohexyl) quinazolin-4-amine::US9943516, 1-3
SMILES C1CC1c1ccc2ncnc(N[C@H]3CC[C@@H](CC3)N3CCOCC3)c2c1
InChI Key InChIKey=YAQITVVGTKOTSL-IYARVYRRSA-N
Data  1 IC50
  Tab Delimited (TSV)   2D SDfile   Computed 3D by Vconf -m prep SDfile
Find this compound or compounds like it in BindingDB:
Activity Spreadsheet -- Enzyme Inhibition Constant Data from BindingDB
Found 1 hit for monomerid = 388444
TargetInterleukin-1 receptor-associated kinase 4(Homo sapiens (Human))
Merck Sharp & Dohme
US Patent
LigandPNGBDBM388444(6-cyclopropyl-N- (trans-4- morpholin-4- ylcyclohex...)
Affinity DataIC50:  5nM. Assay description: The kinase activity of IRAK4 is determined by its ability to catalyze the phosphorylation of a fluorescent polypeptide substrate. The extent of phosp...
Ligand InfoPC cidPC sid
In DepthDetails US Patent