BDBM388474 US9944618, Compound ID No. 8
SMILES CNC[C@@H]([C@H](OCC(=O)NC1CCC1)c1ccccc1)c1ccc2ccccc2c1
InChI Key InChIKey=QMENLBGMQQGOFL-AOYPEHQESA-N
Data  3 KI
  Tab Delimited (TSV)   2D SDfile   Computed 3D by Vconf -m prep SDfile
Find this compound or compounds like it in BindingDB:
Activity Spreadsheet -- Enzyme Inhibition Constant Data from BindingDB
Found 3 hits for monomerid = 388474
TargetSodium-dependent serotonin transporter(Homo sapiens (Human))
Mayo Foundation
US Patent
LigandPNGBDBM388474(US9944618, Compound ID No. 8)
Affinity DataKi:  1.30nM. Assay description: SERT: This protocol was designed to measure inhibition of uptake by the human serotonin transporter. The reagents were human SERT (HEK293F) cells, fl...
Ligand InfoPC cidPC sid
In DepthDetails US Patent
TargetSodium-dependent noradrenaline transporter(Homo sapiens (Human))
Mayo Foundation
US Patent
LigandPNGBDBM388474(US9944618, Compound ID No. 8)
Affinity DataKi:  1.40nM. Assay description: NET: This protocol was designed to measure inhibition of uptake by the human norepinephrine transporter. The reagents were human NET (HEK293F) cells,...
Ligand InfoPC cidPC sid
In DepthDetails US Patent
TargetSodium-dependent dopamine transporter(Homo sapiens (Human))
Mayo Foundation
US Patent
LigandPNGBDBM388474(US9944618, Compound ID No. 8)
Affinity DataKi:  10.8nM. Assay description: DAT: This protocol was designed to measure inhibition of uptake by the human dopamine transporter. The reagents were human DAT (HEK293F) cells, GBR 1...
Ligand InfoPC cidPC sid
In DepthDetails US Patent