BDBM388772 2-Fluoro-N-methyl-4-[7-(1-quinolin-6-ylcyclopropyl)imidazo[1,2-b][1,2,4]triazin-2-yl]benzamide::US10738052, Example 102::US11261191, Example 102::US9944645, 102
SMILES CNC(=O)c1ccc(cc1F)-c1cnc2ncc(n2n1)C1(CC1)c1ccc2ncccc2c1
InChI Key InChIKey=MRTZWGFIDGEVBA-UHFFFAOYSA-N
Data  3 IC50
  Tab Delimited (TSV)   2D SDfile   Computed 3D by Vconf -m prep SDfile
Find this compound or compounds like it in BindingDB:
Activity Spreadsheet -- Enzyme Inhibition Constant Data from BindingDB
Found 3 hits for monomerid = 388772
TargetHepatocyte growth factor receptor(Homo sapiens (Human))
Incyte
US Patent
LigandPNGBDBM388772(2-Fluoro-N-methyl-4-[7-(1-quinolin-6-ylcyclopropyl...)
Affinity DataIC50: <500nM. Assay description: Compounds were screened in vitro for their ability to inhibit c-Met kinase activity. The IC50 values of compounds for the inhibition of c-Met kinase ...
Ligand InfoPC cidPC sid
In DepthDetails US Patent
TargetHepatocyte growth factor receptor(Homo sapiens (Human))
Incyte
US Patent
LigandPNGBDBM388772(2-Fluoro-N-methyl-4-[7-(1-quinolin-6-ylcyclopropyl...)
Affinity DataIC50: <500nM. Assay description: Compounds were screened in vitro for their ability to inhibit c-Met kinase activity. The IC50 values of compounds for the inhibition of c-Met kinase ...
Ligand InfoPC cidPC sid
In DepthDetails US Patent
TargetHepatocyte growth factor receptor(Homo sapiens (Human))
Incyte
US Patent
LigandPNGBDBM388772(2-Fluoro-N-methyl-4-[7-(1-quinolin-6-ylcyclopropyl...)
Affinity DataIC50: <500nM. Assay description: Briefly, histidine-tagged c-Met catalytic domain fusion protein was used for the assay. IC50 measurements were based on the degree of phosphorylation...
Ligand InfoPC cidPC sid
In DepthDetails US Patent