BDBM388848 6-(1-{6-[4-(Azetidin-1-ylcarbonyl)-3-chlorophenyl]imidazo[1,2-a]pyrimidin-3-yl}cyclopropyl)quinoline::US10738052, Example 178::US11261191, Example 178::US9944645, 178
SMILES Clc1cc(ccc1C(=O)N1CCC1)-c1cnc2ncc(n2c1)C1(CC1)c1ccc2ncccc2c1
InChI Key InChIKey=GHHUMEOWIFDPLV-UHFFFAOYSA-N
Data  3 IC50
  Tab Delimited (TSV)   2D SDfile   Computed 3D by Vconf -m prep SDfile
Find this compound or compounds like it in BindingDB:
Activity Spreadsheet -- Enzyme Inhibition Constant Data from BindingDB
Found 3 hits for monomerid = 388848
TargetHepatocyte growth factor receptor(Homo sapiens (Human))
Incyte
US Patent
LigandPNGBDBM388848(6-(1-{6-[4-(Azetidin-1-ylcarbonyl)-3-chlorophenyl]...)
Affinity DataIC50: <500nM. Assay description: Compounds were screened in vitro for their ability to inhibit c-Met kinase activity. The IC50 values of compounds for the inhibition of c-Met kinase ...
Ligand InfoPC cidPC sid
In DepthDetails US Patent
TargetHepatocyte growth factor receptor(Homo sapiens (Human))
Incyte
US Patent
LigandPNGBDBM388848(6-(1-{6-[4-(Azetidin-1-ylcarbonyl)-3-chlorophenyl]...)
Affinity DataIC50: <500nM. Assay description: Compounds were screened in vitro for their ability to inhibit c-Met kinase activity. The IC50 values of compounds for the inhibition of c-Met kinase ...
Ligand InfoPC cidPC sid
In DepthDetails US Patent
TargetHepatocyte growth factor receptor(Homo sapiens (Human))
Incyte
US Patent
LigandPNGBDBM388848(6-(1-{6-[4-(Azetidin-1-ylcarbonyl)-3-chlorophenyl]...)
Affinity DataIC50: <500nM. Assay description: Briefly, histidine-tagged c-Met catalytic domain fusion protein was used for the assay. IC50 measurements were based on the degree of phosphorylation...
Ligand InfoPC cidPC sid
In DepthDetails US Patent