BDBM388969 4-[5-{[(3R)-1-(2- cyanoethyl)piperidin-3-yl]methoxy}- 8-(3-methyl-2-oxo-2,3-dihydro-1,3- benzoxazol-6-yl)imidazo[1,2- c]pyrimidin-7-yl]benzonitrile::US10800779, Example 83::US11401272, Example 83::US9944647, Example 83
SMILES Cn1c2ccc(cc2oc1=O)-c1c(nc(OC[C@@H]2CCCN(CCC#N)C2)n2ccnc12)-c1ccc(cc1)C#N
InChI Key InChIKey=OAPUEZUDPKIEQL-OAQYLSRUSA-N
Data  3 IC50
  Tab Delimited (TSV)   2D SDfile   Computed 3D by Vconf -m prep SDfile
Find this compound or compounds like it in BindingDB:
Activity Spreadsheet -- Enzyme Inhibition Constant Data from BindingDB
Found 3 hits for monomerid = 388969
TargetLysine-specific histone demethylase 1A(Homo sapiens (Human))
Incyte
US Patent
LigandPNGBDBM388969(4-[5-{[(3R)-1-(2- cyanoethyl)piperidin-3-yl]methox...)
Affinity DataIC50: <50nM. Assay description: LANCE LSD1/KDM1A demethylase assay-10 μL of 1 nM LSD-1 enzyme (ENZO BML-SE544-0050) in the assay buffer (50 mM Tris, pH 7.5, 0.01% Tween-20, 25 ...
Ligand InfoPC cidPC sid
In DepthDetails US Patent
TargetLysine-specific histone demethylase 1A(Homo sapiens (Human))
Incyte
US Patent
LigandPNGBDBM388969(4-[5-{[(3R)-1-(2- cyanoethyl)piperidin-3-yl]methox...)
Affinity DataIC50: <50nM. Assay description: LANCE LSD1/KDM1A demethylase assay 10 μL of 1 nM LSD-1 enzyme (ENZO BML-SE544-0050) in the assay buffer (50 mM Tris, pH 7.5, 0.01% Tween-20, 25 ...
Ligand InfoPC cidPC sid
In DepthDetails US Patent
TargetLysine-specific histone demethylase 1A(Homo sapiens (Human))
Incyte
US Patent
LigandPNGBDBM388969(4-[5-{[(3R)-1-(2- cyanoethyl)piperidin-3-yl]methox...)
Affinity DataIC50: <50nM. Assay description: LANCE LSD1/KDM1A demethylase assay—10 μL of 1 nM LSD-1 enzyme (ENZO BML-SE544-0050) in the assay buffer (50 mM Tris, pH 7.5, 0.01% Tween-20, 25 ...
Ligand InfoPC cidPC sid
In DepthDetails US Patent