BDBM388993 4-{5-[4-(dimethylamino)piperidin-1- yl]-8-[3-(hydroxymethyl)-4- methylphenyl]imidazo[1,2- c]pyrimidin-7-yl}benzonitrile::US10800779, Example 102::US11401272, Example 102::US9944647, Example 102
SMILES CN(C)C1CCN(CC1)c1nc(-c2ccc(cc2)C#N)c(-c2ccc(C)c(CO)c2)c2nccn12
InChI Key InChIKey=PPTNURMBHBUKLH-UHFFFAOYSA-N
Data  3 IC50
  Tab Delimited (TSV)   2D SDfile   Computed 3D by Vconf -m prep SDfile
Find this compound or compounds like it in BindingDB:
Activity Spreadsheet -- Enzyme Inhibition Constant Data from BindingDB
Found 3 hits for monomerid = 388993
TargetLysine-specific histone demethylase 1A(Homo sapiens (Human))
Incyte
US Patent
LigandPNGBDBM388993(4-{5-[4-(dimethylamino)piperidin-1- yl]-8-[3-(hydr...)
Affinity DataIC50: <50nM. Assay description: LANCE LSD1/KDM1A demethylase assay-10 μL of 1 nM LSD-1 enzyme (ENZO BML-SE544-0050) in the assay buffer (50 mM Tris, pH 7.5, 0.01% Tween-20, 25 ...
Ligand InfoPC cidPC sid
In DepthDetails US Patent
TargetLysine-specific histone demethylase 1A(Homo sapiens (Human))
Incyte
US Patent
LigandPNGBDBM388993(4-{5-[4-(dimethylamino)piperidin-1- yl]-8-[3-(hydr...)
Affinity DataIC50: <50nM. Assay description: LANCE LSD1/KDM1A demethylase assay 10 μL of 1 nM LSD-1 enzyme (ENZO BML-SE544-0050) in the assay buffer (50 mM Tris, pH 7.5, 0.01% Tween-20, 25 ...
Ligand InfoPC cidPC sid
In DepthDetails US Patent
TargetLysine-specific histone demethylase 1A(Homo sapiens (Human))
Incyte
US Patent
LigandPNGBDBM388993(4-{5-[4-(dimethylamino)piperidin-1- yl]-8-[3-(hydr...)
Affinity DataIC50: <50nM. Assay description: LANCE LSD1/KDM1A demethylase assay—10 μL of 1 nM LSD-1 enzyme (ENZO BML-SE544-0050) in the assay buffer (50 mM Tris, pH 7.5, 0.01% Tween-20, 25 ...
Ligand InfoPC cidPC sid
In DepthDetails US Patent