BDBM389033 USRE46792, 19
SMILES COc1ccc(cc1OCC(F)(F)F)-c1nc(CNC(=O)c2ncccc2C)co1
InChI Key InChIKey=DXLHTTOABFTMKT-UHFFFAOYSA-N
Data  1 IC50
  Tab Delimited (TSV)   2D SDfile   Computed 3D by Vconf -m prep SDfile
Find this compound or compounds like it in BindingDB:
Activity Spreadsheet -- Enzyme Inhibition Constant Data from BindingDB
Found 1 hit for monomerid = 389033
TargetcAMP-specific 3',5'-cyclic phosphodiesterase 4D(Homo sapiens (Human))
Otsuka Pharmaceutical
US Patent
LigandPNGBDBM389033(USRE46792, 19)
Affinity DataIC50: <50nM. Assay description: Necessary amounts of test compounds were weighed, and 100% dimethylsulfoxide (DMSO) was added thereto to adjust the concentration to 10 mM. The solut...
Ligand InfoPC cidPC sid
In DepthDetails US Patent