BDBM389050 USRE46792, 103
SMILES CCOc1cc(ccc1OC)-c1nc(CCC(=O)c2ccccc2OCC)co1
InChI Key InChIKey=BYIGCARXJFBBRL-UHFFFAOYSA-N
Data  1 IC50
  Tab Delimited (TSV)   2D SDfile   Computed 3D by Vconf -m prep SDfile
Find this compound or compounds like it in BindingDB:
Activity Spreadsheet -- Enzyme Inhibition Constant Data from BindingDB
Found 1 hit for monomerid = 389050
TargetcAMP-specific 3',5'-cyclic phosphodiesterase 4D(Homo sapiens (Human))
Otsuka Pharmaceutical
US Patent
LigandPNGBDBM389050(USRE46792, 103)
Affinity DataIC50: <50nM. Assay description: Necessary amounts of test compounds were weighed, and 100% dimethylsulfoxide (DMSO) was added thereto to adjust the concentration to 10 mM. The solut...
Ligand InfoPC cidPC sid
In DepthDetails US Patent