BDBM389086 USRE46792, 278
SMILES COc1ccc(cc1OC(C)C)-c1nc(CCC(=O)c2ccccc2OCC(F)F)co1
InChI Key InChIKey=VRKCPRYDAZUMNU-UHFFFAOYSA-N
Data  1 IC50
  Tab Delimited (TSV)   2D SDfile   Computed 3D by Vconf -m prep SDfile
Find this compound or compounds like it in BindingDB:
Activity Spreadsheet -- Enzyme Inhibition Constant Data from BindingDB
Found 1 hit for monomerid = 389086
TargetcAMP-specific 3',5'-cyclic phosphodiesterase 4D(Homo sapiens (Human))
Otsuka Pharmaceutical
US Patent
LigandPNGBDBM389086(USRE46792, 278)
Affinity DataIC50: <50nM. Assay description: Necessary amounts of test compounds were weighed, and 100% dimethylsulfoxide (DMSO) was added thereto to adjust the concentration to 10 mM. The solut...
Ligand InfoPC cidPC sid
In DepthDetails US Patent