BDBM389126 USRE46792, 352
SMILES CCOc1ccccc1C(=O)NCc1coc(n1)-c1ccc(OC(F)F)c(OC(C)C)c1
InChI Key InChIKey=VFBILHPIHUPBPZ-UHFFFAOYSA-N
Data  1 IC50
  Tab Delimited (TSV)   2D SDfile   Computed 3D by Vconf -m prep SDfile
Find this compound or compounds like it in BindingDB:
Activity Spreadsheet -- Enzyme Inhibition Constant Data from BindingDB
Found 1 hit for monomerid = 389126
TargetcAMP-specific 3',5'-cyclic phosphodiesterase 4D(Homo sapiens (Human))
Otsuka Pharmaceutical
US Patent
LigandPNGBDBM389126(USRE46792, 352)
Affinity DataIC50: <50nM. Assay description: Necessary amounts of test compounds were weighed, and 100% dimethylsulfoxide (DMSO) was added thereto to adjust the concentration to 10 mM. The solut...
In DepthDetails US Patent