BDBM389161 (R)-3-(6-chloro-5- fluoro-1H-indol-3-yl) pyrrolidine-2,5-dione::US9949951, 8
SMILES Fc1cc2c(c[nH]c2cc1Cl)[C@H]1CC(=O)NC1=O
InChI Key
Data  2 IC50
  Tab Delimited (TSV)   2D SDfile   Computed 3D by Vconf -m prep SDfile
Find this compound or compounds like it in BindingDB:
Activity Spreadsheet -- Enzyme Inhibition Constant Data from BindingDB
Found 2 hits for monomerid = 389161
TargetIndoleamine 2,3-dioxygenase 1(Homo sapiens (Human))
Iteos Therapeutics
Curated by ChEMBL
LigandPNGBDBM389161((R)-3-(6-chloro-5- fluoro-1H-indol-3-yl) pyrrolidi...)
Affinity DataIC50:  580nM. Assay description: Inhibition of human recombinant IDO-1 using L-Trp as substrate after 15 mins by PDMAB-based assay
Ligand InfoPC cidPC sid
In DepthDetails ArticlePubMed
TargetIndoleamine 2,3-dioxygenase 1(Homo sapiens (Human))
Iteos Therapeutics
Curated by ChEMBL
LigandPNGBDBM389161((R)-3-(6-chloro-5- fluoro-1H-indol-3-yl) pyrrolidi...)
Affinity DataIC50:  3.60E+3nM. Assay description: The compounds of the present invention inhibit the enzymatic activity of human IDO1.To measure enzymatic activity of human IDO1, the reaction mixture...
Ligand InfoPC cidPC sid
In DepthDetails US Patent