BDBM389390 US9951027, 2-156
SMILES COc1cc2n([C@@H]3C[C@H](C)CC(C)(C)C3)c(Nc3ccc(cc3)C(F)(F)F)nc2cc1C(O)=O
InChI Key InChIKey=LRPWZHSZAYKBPY-WMLDXEAASA-N
Data  1 IC50
  Tab Delimited (TSV)   2D SDfile   Computed 3D by Vconf -m prep SDfile
Find this compound or compounds like it in BindingDB:
Activity Spreadsheet -- Enzyme Inhibition Constant Data from BindingDB
Found 1 hit for monomerid = 389390
TargetIsocitrate dehydrogenase [NADP] cytoplasmic [R132H](Homo sapiens (Human))
Bayer Pharma Aktiengesellschaft
US Patent
LigandPNGBDBM389390(US9951027, 2-156)
Affinity DataIC50:  10nM. Assay description: mIDH1 catalyzes the NADPH-dependent reduction of alpha-ketoglutarate (α-KG) to (2R)-2-hydroxyglutarate (2-HG). NADPH consumption was measured by...
Ligand InfoPC cidPC sid
In DepthDetails US Patent