BDBM389490 US9951027, 3-124
SMILES CC(C)c1ccc(Nc2nc3c(F)c(ccc3n2[C@@H]2C[C@H](C)CC(C)(C)C2)C(O)=O)cc1
InChI Key InChIKey=JXUIDNGFNAWSHM-QFBILLFUSA-N
Data  1 IC50
  Tab Delimited (TSV)   2D SDfile   Computed 3D by Vconf -m prep SDfile
Find this compound or compounds like it in BindingDB:
Activity Spreadsheet -- Enzyme Inhibition Constant Data from BindingDB
Found 1 hit for monomerid = 389490
TargetIsocitrate dehydrogenase [NADP] cytoplasmic [R132H](Homo sapiens (Human))
Bayer Pharma Aktiengesellschaft
US Patent
LigandPNGBDBM389490(US9951027, 3-124)
Affinity DataIC50:  10nM. Assay description: mIDH1 catalyzes the NADPH-dependent reduction of alpha-ketoglutarate (α-KG) to (2R)-2-hydroxyglutarate (2-HG). NADPH consumption was measured by...
Ligand InfoPC cidPC sid
In DepthDetails US Patent