BDBM389618 US10357546, ND-336::US9951035, ND-336 (5)
SMILES NCc1ccc(Oc2ccc(cc2)S(=O)(=O)CC2CS2)cc1
InChI Key InChIKey=GRRDUDJQILRRES-UHFFFAOYSA-N
Data  8 KI
  Tab Delimited (TSV)   2D SDfile   Computed 3D by Vconf -m prep SDfile
Find this compound or compounds like it in BindingDB:
Activity Spreadsheet -- Enzyme Inhibition Constant Data from BindingDB
Found 8 hits for monomerid = 389618
Target72 kDa type IV collagenase(Homo sapiens (Human))
University Of Notre Dame
Curated by ChEMBL
LigandPNGBDBM389618(US10357546, ND-336 | US9951035, ND-336 (5))
Affinity DataKi:  85nM. Assay description: Slow binding inhibition of human recombinant MMP2 using MOCAc-Pro-Leu-Gly-Leu-A2pr(Dnp)-Ala-Arg-NH2 substrate
In DepthDetails ArticlePubMed
TargetMatrix metalloproteinase-14(Homo sapiens (Human))
University Of Notre Dame
Curated by ChEMBL
LigandPNGBDBM389618(US10357546, ND-336 | US9951035, ND-336 (5))
Affinity DataKi:  120nM. Assay description: Slow binding inhibition of human recombinant MMP14 catalytic domain using MOCAc-Pro-Leu-Gly-Leu-A2pr(Dnp)-Ala-Arg-NH2 substrate
In DepthDetails ArticlePubMed
TargetMatrix metalloproteinase-9(Homo sapiens (Human))
University Of Notre Dame
Curated by ChEMBL
LigandPNGBDBM389618(US10357546, ND-336 | US9951035, ND-336 (5))
Affinity DataKi:  150nM. Assay description: Slow binding inhibition of human recombinant MMP9 catalytic domain using MOCAc-Pro-Leu-Gly-Leu-A2pr(Dnp)-Ala-Arg-NH2 substrate
In DepthDetails ArticlePubMed
TargetNeutrophil collagenase(Homo sapiens (Human))
University Of Notre Dame Du Lac
US Patent
LigandPNGBDBM389618(US10357546, ND-336 | US9951035, ND-336 (5))
Affinity DataKi:  150nM. Assay description: Human recombinant active MMP-2 and MMP-7, and the catalytic domains of MMP-3 and MMP-14/MT1-MMP were purchased from EMD Chemicals, Inc. (San Diego, C...
In DepthDetails US Patent
TargetMatrix metalloproteinase-9(Homo sapiens (Human))
University Of Notre Dame
Curated by ChEMBL
LigandPNGBDBM389618(US10357546, ND-336 | US9951035, ND-336 (5))
Affinity DataKi:  150nM. Assay description: The term selective inhibitor as used in reference to MMPs refers to an inhibitor that inhibits the enzymatic activity of one MMP in the presence of o...
In DepthDetails US Patent
TargetNeutrophil collagenase(Homo sapiens (Human))
University Of Notre Dame Du Lac
US Patent
LigandPNGBDBM389618(US10357546, ND-336 | US9951035, ND-336 (5))
Affinity DataKi:  7.70E+3nM. Assay description: Non-competitive inhibition of human recombinant MMP8 catalytic domain using Mca-Lys-Pro-Leu-Gly-Leu-Dpa-Ala-Arg-NH2 substrate
In DepthDetails ArticlePubMed
TargetNeutrophil collagenase(Homo sapiens (Human))
University Of Notre Dame Du Lac
US Patent
LigandPNGBDBM389618(US10357546, ND-336 | US9951035, ND-336 (5))
Affinity DataKi:  7.70E+3nM. Assay description: The term selective inhibitor as used in reference to MMPs refers to an inhibitor that inhibits the enzymatic activity of one MMP in the presence of o...
In DepthDetails US Patent
TargetMatrix metalloproteinase-9(Homo sapiens (Human))
University Of Notre Dame
Curated by ChEMBL
LigandPNGBDBM389618(US10357546, ND-336 | US9951035, ND-336 (5))
Affinity DataKi:  7.70E+3nM. Assay description: Human recombinant active MMP-2 and MMP-7, and the catalytic domains of MMP-3 and MMP-14/MT1-MMP were purchased from EMD Chemicals, Inc. (San Diego, C...
In DepthDetails US Patent