BDBM389649 2-(1-acryloylpyrrolidin-3-yl)-4-(4-phenoxyphenyl)pyrimidine-5-carboxamide::US11345695, Example 22::US11840513, Example 22::US9951056, Example 22
SMILES NC(=O)c1cnc(nc1-c1ccc(Oc2ccccc2)cc1)C1CCN(C1)C(=O)C=C
InChI Key InChIKey=HZCJWEMXBJNSMP-UHFFFAOYSA-N
Data  4 IC50
  Tab Delimited (TSV)   2D SDfile   Computed 3D by Vconf -m prep SDfile
Find this compound or compounds like it in BindingDB:
Activity Spreadsheet -- Enzyme Inhibition Constant Data from BindingDB
Found 4 hits for monomerid = 389649
TargetTyrosine-protein kinase BTK(Homo sapiens (Human))
Guangzhou Innocare Pharma Tech
US Patent
LigandPNGBDBM389649(2-(1-acryloylpyrrolidin-3-yl)-4-(4-phenoxyphenyl)p...)
Affinity DataIC50: <500nM. Assay description: 1× and 2× assay buffer were made at first. BTK kinase was diluted with 1× assay buffer but substrate was diluted with 2× assay buffer. 1 ul of dilute...
Ligand InfoPC cidPC sid
In DepthDetails US Patent
TargetTyrosine-protein kinase BTK(Homo sapiens (Human))
Guangzhou Innocare Pharma Tech
US Patent
LigandPNGBDBM389649(2-(1-acryloylpyrrolidin-3-yl)-4-(4-phenoxyphenyl)p...)
Affinity DataIC50: <500nM. Assay description: The activity of the Examples and Analogs described herein, as inhibitors of BTK are demonstrated and confirmed by pharmacological in vitro assays. Ac...
Ligand InfoPC cidPC sid
In DepthDetails US Patent
TargetTyrosine-protein kinase BTK(Homo sapiens (Human))
Guangzhou Innocare Pharma Tech
US Patent
LigandPNGBDBM389649(2-(1-acryloylpyrrolidin-3-yl)-4-(4-phenoxyphenyl)p...)
Affinity DataIC50: <500nM. Assay description: 1x and 2x assay buffer were made at first. BTK kinase was diluted with 1× assay buffer but substrate was diluted with 2× assay buffer. 1 ul of dilute...
Ligand InfoPC cidPC sid
In DepthDetails US Patent
TargetTyrosine-protein kinase BTK(Homo sapiens (Human))
Guangzhou Innocare Pharma Tech
US Patent
LigandPNGBDBM389649(2-(1-acryloylpyrrolidin-3-yl)-4-(4-phenoxyphenyl)p...)
Affinity DataIC50: <500nM. Assay description: 1× and 2× assay buffer were made at first. BTK kinase was diluted with 1× assay buffer but substrate was diluted with 2× assay buffer. 1 ul of dilute...
Ligand InfoPC cidPC sid
In DepthDetails US Patent