BDBM389730 1-{(R)-4-[2-(2-Cyclopropyl-pyrimidin-5-yl)-5-trifluoromethyl-1,2,3,4-tetrahydro-isoquinolin-8-yl]-2-methyl-piperazin-1-yl}-2-(5-methyl-pyrazol-1-yl)-ethanone::US9951063, 49
SMILES C[C@@H]1CN(CCN1C(=O)Cn1nccc1C)c1ccc(c2CCN(Cc12)c1cnc(nc1)C1CC1)C(F)(F)F
InChI Key InChIKey=KHDZDHCWOSECAJ-LJQANCHMSA-N
Data  1 IC50
  Tab Delimited (TSV)   2D SDfile   Computed 3D by Vconf -m prep SDfile
Find this compound or compounds like it in BindingDB:
Activity Spreadsheet -- Enzyme Inhibition Constant Data from BindingDB
Found 1 hit for monomerid = 389730
TargetC-X-C chemokine receptor type 3(Homo sapiens (Human))
Idorsia Pharmaceuticals
US Patent
LigandPNGBDBM389730(1-{(R)-4-[2-(2-Cyclopropyl-pyrimidin-5-yl)-5-trifl...)
Affinity DataIC50:  3.56nM. Assay description: The bioactivity of compounds is tested in a fluorometric imaging plate reader (FLIPR: Molecular Devices) using engineered CHO-K1 cells expressing the...
Ligand InfoPC cidPC sid
In DepthDetails US Patent