BDBM389796 2-Imidazo[4,5-b]pyridin-3-yl-1-{(R)-2-methyl-4-[2-(5-phenyl-thiazol-2-yl)-1,2,3,4-tetrahydro-isoquinolin-8-yl]-piperazin-1-yl}-ethanone::US9951063, 115
SMILES C[C@@H]1CN(CCN1C(=O)Cn1cnc2cccnc12)c1cccc2CCN(Cc12)c1ncc(s1)-c1ccccc1
InChI Key InChIKey=DSZDCDNQXRMPLJ-JOCHJYFZSA-N
Data  1 IC50
  Tab Delimited (TSV)   2D SDfile   Computed 3D by Vconf -m prep SDfile
Find this compound or compounds like it in BindingDB:
Activity Spreadsheet -- Enzyme Inhibition Constant Data from BindingDB
Found 1 hit for monomerid = 389796
TargetC-X-C chemokine receptor type 3(Homo sapiens (Human))
Idorsia Pharmaceuticals
US Patent
LigandPNGBDBM389796(2-Imidazo[4,5-b]pyridin-3-yl-1-{(R)-2-methyl-4-[2-...)
Affinity DataIC50:  13.3nM. Assay description: The bioactivity of compounds is tested in a fluorometric imaging plate reader (FLIPR: Molecular Devices) using engineered CHO-K1 cells expressing the...
Ligand InfoPC cidPC sid
In DepthDetails US Patent