BDBM389830 4-[3-(4-Chlorophenyl)-3H- imidazo[4,5-c]pyridin-2- yl]pyridine::US10766897, Compound 2::US10968223, Compound 2::US9951068, Compound 120::US9951068, Compound 2
SMILES Clc1ccc(cc1)-n1c(nc2ccncc12)-c1ccncc1
InChI Key InChIKey=WESFGBVFCGHYNE-UHFFFAOYSA-N
Data  9 IC50
  Tab Delimited (TSV)   2D SDfile   Computed 3D by Vconf -m prep SDfile
Find this compound or compounds like it in BindingDB:
Activity Spreadsheet -- Enzyme Inhibition Constant Data from BindingDB
Found 9 hits for monomerid = 389830
TargetMembrane primary amine oxidase(Homo sapiens (Human))
Proximagen
US Patent
LigandPNGBDBM389830(4-[3-(4-Chlorophenyl)-3H- imidazo[4,5-c]pyridin-2-...)
Affinity DataIC50:  700nM. Assay description: SSAO: All primary assays were performed at RT. with purified recombinantly expressed human SSAO. Enzyme was prepared essentially as described in Öhma...
Ligand InfoPC cidPC sid
In DepthDetails US Patent
TargetMembrane primary amine oxidase(Homo sapiens (Human))
Proximagen
US Patent
LigandPNGBDBM389830(4-[3-(4-Chlorophenyl)-3H- imidazo[4,5-c]pyridin-2-...)
Affinity DataIC50:  700nM. Assay description: SSAO: All primary assays were performed at RT. with purified recombinantly expressed human SSAO. Enzyme was prepared essentially as described in Öhma...
Ligand InfoPC cidPC sid
In DepthDetails US Patent
TargetPotassium voltage-gated channel subfamily H member 2(Homo sapiens (Human))
Proximagen
US Patent
LigandPNGBDBM389830(4-[3-(4-Chlorophenyl)-3H- imidazo[4,5-c]pyridin-2-...)
Affinity DataIC50: >1.00E+4nM. Assay description: Compounds of the invention were tested for inhibition of the human ether a go-go related gene (hERG) K+ channel using IonWorks patch clamp electrophy...
Ligand InfoPC cidPC sid
In DepthDetails US Patent
TargetPotassium voltage-gated channel subfamily H member 2(Homo sapiens (Human))
Proximagen
US Patent
LigandPNGBDBM389830(4-[3-(4-Chlorophenyl)-3H- imidazo[4,5-c]pyridin-2-...)
Affinity DataIC50:  5.50E+3nM. Assay description: Compounds of the invention were tested for inhibition of the human ether a go-go related gene (hERG) K+ channel using IonWorks patch clamp electrophy...
Ligand InfoPC cidPC sid
In DepthDetails US Patent
TargetMembrane primary amine oxidase(Homo sapiens (Human))
Proximagen
US Patent
LigandPNGBDBM389830(4-[3-(4-Chlorophenyl)-3H- imidazo[4,5-c]pyridin-2-...)
Affinity DataIC50:  700nM. Assay description: All primary assays were performed at RT. with purified recombinantly expressed human SSAO. Enzyme was prepared essentially as described in Öhman et a...
Ligand InfoPC cidPC sid
In DepthDetails US Patent
TargetPotassium voltage-gated channel subfamily H member 2(Homo sapiens (Human))
Proximagen
US Patent
LigandPNGBDBM389830(4-[3-(4-Chlorophenyl)-3H- imidazo[4,5-c]pyridin-2-...)
Affinity DataIC50: >1.00E+4nM. Assay description: Electrophysiological recordings were made from a Chinese Hamster Lung cell line stably expressing the full length hERG channel. Single cell ion curre...
Ligand InfoPC cidPC sid
In DepthDetails US Patent
TargetMembrane primary amine oxidase(Homo sapiens (Human))
Proximagen
US Patent
LigandPNGBDBM389830(4-[3-(4-Chlorophenyl)-3H- imidazo[4,5-c]pyridin-2-...)
Affinity DataIC50:  700nM. Assay description: SSAO: All primary assays were performed at RT. with purified recombinantly expressed human SSAO. Enzyme was prepared essentially as described in Öhma...
Ligand InfoPC cidPC sid
In DepthDetails US Patent
TargetPotassium voltage-gated channel subfamily H member 2(Homo sapiens (Human))
Proximagen
US Patent
LigandPNGBDBM389830(4-[3-(4-Chlorophenyl)-3H- imidazo[4,5-c]pyridin-2-...)
Affinity DataIC50: >1.00E+4nM. Assay description: hERG: Compounds of the invention were tested for inhibition of the human ether a go-go related gene (hERG) K+ channel using IonWorks patch clamp elec...
Ligand InfoPC cidPC sid
In DepthDetails US Patent
TargetMembrane primary amine oxidase(Homo sapiens (Human))
Proximagen
US Patent
LigandPNGBDBM389830(4-[3-(4-Chlorophenyl)-3H- imidazo[4,5-c]pyridin-2-...)
Affinity DataIC50:  700nM. Assay description: All primary assays were performed at RT. with purified recombinantly expressed human SSAO. Enzyme was prepared essentially as described in Öhman et a...
Ligand InfoPC cidPC sid
In DepthDetails US Patent