BDBM389962 4-{5-[1-(4-Bromophenyl)-1H- pyrrolo[2,3-c]pyridin-2- yl]pyrimidin-2-yl}morpholine::US10766897, Compound 133::US10968223, Compound 133::US9951068, Compound 133
SMILES Brc1ccc(cc1)-n1c(cc2ccncc12)-c1cnc(nc1)N1CCOCC1
InChI Key InChIKey=SDLVOLWZPOBUPA-UHFFFAOYSA-N
Data  4 IC50
  Tab Delimited (TSV)   2D SDfile   Computed 3D by Vconf -m prep SDfile
Find this compound or compounds like it in BindingDB:
Activity Spreadsheet -- Enzyme Inhibition Constant Data from BindingDB
Found 4 hits for monomerid = 389962
TargetMembrane primary amine oxidase(Homo sapiens (Human))
Proximagen
US Patent
LigandPNGBDBM389962(4-{5-[1-(4-Bromophenyl)-1H- pyrrolo[2,3-c]pyridin-...)
Affinity DataIC50: <50nM. Assay description: SSAO: All primary assays were performed at RT. with purified recombinantly expressed human SSAO. Enzyme was prepared essentially as described in Öhma...
Ligand InfoPC cidPC sid
In DepthDetails US Patent
TargetMembrane primary amine oxidase(Homo sapiens (Human))
Proximagen
US Patent
LigandPNGBDBM389962(4-{5-[1-(4-Bromophenyl)-1H- pyrrolo[2,3-c]pyridin-...)
Affinity DataIC50: <50nM. Assay description: All primary assays were performed at RT. with purified recombinantly expressed human SSAO. Enzyme was prepared essentially as described in Öhman et a...
Ligand InfoPC cidPC sid
In DepthDetails US Patent
TargetMembrane primary amine oxidase(Homo sapiens (Human))
Proximagen
US Patent
LigandPNGBDBM389962(4-{5-[1-(4-Bromophenyl)-1H- pyrrolo[2,3-c]pyridin-...)
Affinity DataIC50: <50nM. Assay description: SSAO: All primary assays were performed at RT. with purified recombinantly expressed human SSAO. Enzyme was prepared essentially as described in Öhma...
Ligand InfoPC cidPC sid
In DepthDetails US Patent
TargetMembrane primary amine oxidase(Homo sapiens (Human))
Proximagen
US Patent
LigandPNGBDBM389962(4-{5-[1-(4-Bromophenyl)-1H- pyrrolo[2,3-c]pyridin-...)
Affinity DataIC50: <50nM. Assay description: All primary assays were performed at RT. with purified recombinantly expressed human SSAO. Enzyme was prepared essentially as described in Öhman et a...
Ligand InfoPC cidPC sid
In DepthDetails US Patent