BDBM38999 1-[1-(2-methoxyethyl)-2,5-dimethyl-1H-pyrrol-3-yl]-2-[(5-methyl-1,3,4-thiadiazol-2-yl)thio]ethanone::1-[1-(2-methoxyethyl)-2,5-dimethyl-3-pyrrolyl]-2-[(5-methyl-1,3,4-thiadiazol-2-yl)thio]ethanone::1-[1-(2-methoxyethyl)-2,5-dimethyl-pyrrol-3-yl]-2-[(5-methyl-1,3,4-thiadiazol-2-yl)sulfanyl]ethanone::1-[1-(2-methoxyethyl)-2,5-dimethyl-pyrrol-3-yl]-2-[(5-methyl-1,3,4-thiadiazol-2-yl)thio]ethanone::1-[1-(2-methoxyethyl)-2,5-dimethylpyrrol-3-yl]-2-[(5-methyl-1,3,4-thiadiazol-2-yl)sulfanyl]ethanone::MLS000063828::SMR000075702::cid_2200749
SMILES COCCn1c(C)cc(C(=O)CSc2nnc(C)s2)c1C
InChI Key InChIKey=LIHGHSFNDSOTKM-UHFFFAOYSA-N
Data  5 IC50  1 EC50
  Tab Delimited (TSV)   2D SDfile   Computed 3D by Vconf -m prep SDfile
Find this compound or compounds like it in BindingDB:
Activity Spreadsheet -- Enzyme Inhibition Constant Data from BindingDB
Found 6 hits for monomerid = 38999
TargetIsoform 2 of Nuclear receptor ROR-alpha (Alpha-2)(Homo sapiens (Human))
The Scripps Research Institute Molecular Screening Center
Curated by PubChem BioAssay
LigandPNGBDBM38999(1-[1-(2-methoxyethyl)-2,5-dimethyl-1H-pyrrol-3-yl]...)
Affinity DataIC50:  2.55E+3nM. Assay description: Source (MLSCN Center Name): The Scripps Research Institute Molecular Screening Center Center Affiliation: The Scripps Research Institute, TSRI Assay ...
In DepthDetails PCBioAssay
TargetSteroidogenic factor 1(Homo sapiens (Human))
The Scripps Research Institute Molecular Screening Center
Curated by PubChem BioAssay
LigandPNGBDBM38999(1-[1-(2-methoxyethyl)-2,5-dimethyl-1H-pyrrol-3-yl]...)
Affinity DataIC50:  3.46E+3nM. Assay description: Source (MLSCN Center Name): The Scripps Research Institute Molecular Screening Center Center Affiliation: The Scripps Research Institute, TSRI Assay ...
In DepthDetails PCBioAssay
TargetTumor necrosis factor receptor superfamily member 10B(Homo sapiens (Human))
Burnham Center For Chemical Genomics
Curated by PubChem BioAssay
LigandPNGBDBM38999(1-[1-(2-methoxyethyl)-2,5-dimethyl-1H-pyrrol-3-yl]...)
Affinity DataEC50: >1.25E+4nM
In DepthDetails PCBioAssay
TargetSteroidogenic factor 1(Homo sapiens (Human))
The Scripps Research Institute Molecular Screening Center
Curated by PubChem BioAssay
LigandPNGBDBM38999(1-[1-(2-methoxyethyl)-2,5-dimethyl-1H-pyrrol-3-yl]...)
Affinity DataIC50:  5.45E+3nM. Assay description: Source (MLSCN Center Name): The Scripps Research Institute Molecular Screening Center Center Affiliation: The Scripps Research Institute, TSRI Assay ...
In DepthDetails PCBioAssay
TargetEndothelial PAS domain-containing protein 1(Homo sapiens (Human))
Burnham Center For Chemical Genomics
Curated by PubChem BioAssay
LigandPNGBDBM38999(1-[1-(2-methoxyethyl)-2,5-dimethyl-1H-pyrrol-3-yl]...)
Affinity DataIC50:  5.99E+3nM
In DepthDetails PCBioAssay
TargetIsoform 2 of Nuclear receptor ROR-alpha (Alpha-2)(Homo sapiens (Human))
The Scripps Research Institute Molecular Screening Center
Curated by PubChem BioAssay
LigandPNGBDBM38999(1-[1-(2-methoxyethyl)-2,5-dimethyl-1H-pyrrol-3-yl]...)
Affinity DataIC50:  4.36E+3nM. Assay description: Source (MLSCN Center Name): The Scripps Research Institute Molecular Screening Center Center Affiliation: The Scripps Research Institute, TSRI Assay ...
In DepthDetails PCBioAssay