BDBM390021 4-amino-3-(4-phenoxyphenyl)-1- [(3R)-1-[(E)-4-pyrrolidin-1-ylbut-2- enoyl]-3-piperidyl]-6H-pyrrolo[2,3- d]pyridazin-7-one::US10323037, Example 34::US9951077, 34
SMILES Nc1n[nH]c(=O)c2n(cc(-c3ccc(Oc4ccccc4)cc3)c12)[C@@H]1CCCN(C1)C(=O)\C=C\CN1CCCC1
InChI Key InChIKey=DTDAAWRYDDIOBP-GULCCPCXSA-N
Data  2 IC50
  Tab Delimited (TSV)   2D SDfile   Computed 3D by Vconf -m prep SDfile
Find this compound or compounds like it in BindingDB:
Activity Spreadsheet -- Enzyme Inhibition Constant Data from BindingDB
Found 2 hits for monomerid = 390021
TargetTyrosine-protein kinase BTK(Homo sapiens (Human))
Jiangsu Hengrui Medicine
US Patent
LigandPNGBDBM390021(4-amino-3-(4-phenoxyphenyl)-1- [(3R)-1-[(E)-4-pyrr...)
Affinity DataIC50: <10nM. Assay description: The Btk kinase assay was performed using a ADP-Glo Btk kinase assay kit purchased from Promega (Madison, Wis.). The assay was conducted according to ...
Ligand InfoPC cidPC sid
In DepthDetails US Patent
TargetTyrosine-protein kinase BTK(Homo sapiens (Human))
Jiangsu Hengrui Medicine
US Patent
LigandPNGBDBM390021(4-amino-3-(4-phenoxyphenyl)-1- [(3R)-1-[(E)-4-pyrr...)
Affinity DataIC50: <10nM. Assay description: The Btk kinase assay was performed using a ADP-Glo Btk kinase assay kit purchased from Promega (Madison, Wis.). The assay was conducted according to ...
Ligand InfoPC cidPC sid
In DepthDetails US Patent