BDBM390085 US10323037, Example 97::US9951077, 97
SMILES CC#CC(=O)N1CC[C@H](C1)n1cc(-c2ccc(Oc3ccccc3)cc2)c2c(N)n[nH]c(=O)c12
InChI Key InChIKey=CESQOCMQUIZLHZ-GOSISDBHSA-N
Data  2 IC50
  Tab Delimited (TSV)   2D SDfile   Computed 3D by Vconf -m prep SDfile
Find this compound or compounds like it in BindingDB:
Activity Spreadsheet -- Enzyme Inhibition Constant Data from BindingDB
Found 2 hits for monomerid = 390085
TargetTyrosine-protein kinase BTK(Homo sapiens (Human))
Jiangsu Hengrui Medicine
US Patent
LigandPNGBDBM390085(US10323037, Example 97 | US9951077, 97)
Affinity DataIC50:  505nM. Assay description: The Btk kinase assay was performed using a ADP-Glo Btk kinase assay kit purchased from Promega (Madison, Wis.). The assay was conducted according to ...
Ligand InfoPC cidPC sid
In DepthDetails US Patent
TargetTyrosine-protein kinase BTK(Homo sapiens (Human))
Jiangsu Hengrui Medicine
US Patent
LigandPNGBDBM390085(US10323037, Example 97 | US9951077, 97)
Affinity DataIC50:  505nM. Assay description: The Btk kinase assay was performed using a ADP-Glo Btk kinase assay kit purchased from Promega (Madison, Wis.). The assay was conducted according to ...
Ligand InfoPC cidPC sid
In DepthDetails US Patent