BDBM390157 US9951086, Example 49
SMILES CN(CC1CC1)C(=O)Cn1cc2cc(NC(=O)c3cccc(n3)C(F)(F)F)c(OCC3CC3)cc2n1
InChI Key InChIKey=VWOBMFVFQXUARA-UHFFFAOYSA-N
Data  1 IC50
  Tab Delimited (TSV)   2D SDfile   Computed 3D by Vconf -m prep SDfile
Find this compound or compounds like it in BindingDB:
Activity Spreadsheet -- Enzyme Inhibition Constant Data from BindingDB
Found 1 hit for monomerid = 390157
TargetInterleukin-1 receptor-associated kinase 4(Homo sapiens (Human))
Bayer Pharma Aktiengesellschaft
US Patent
LigandPNGBDBM390157(US9951086, Example 49)
Affinity DataIC50:  10nM. Assay description: For the assay, 11 different concentrations in the range from 20 μM to 0.073 nM were prepared from a 2 mM solution of the test substance in DMSO....
Ligand InfoPC cidPC sid
In DepthDetails US Patent