BDBM390406 US9951086, Example 293
SMILES FC(F)(F)c1cccc(n1)C(=O)Nc1cc2cn(CC(=O)N3CCOCC3)nc2cc1OC1CCCC1
InChI Key InChIKey=BYYBMTNYNVHDOY-UHFFFAOYSA-N
Data  1 IC50
  Tab Delimited (TSV)   2D SDfile   Computed 3D by Vconf -m prep SDfile
Find this compound or compounds like it in BindingDB:
Activity Spreadsheet -- Enzyme Inhibition Constant Data from BindingDB
Found 1 hit for monomerid = 390406
TargetInterleukin-1 receptor-associated kinase 4(Homo sapiens (Human))
Bayer Pharma Aktiengesellschaft
US Patent
LigandPNGBDBM390406(US9951086, Example 293)
Affinity DataIC50:  6nM. Assay description: For the assay, 11 different concentrations in the range from 20 μM to 0.073 nM were prepared from a 2 mM solution of the test substance in DMSO....
Ligand InfoPC cidPC sid
In DepthDetails US Patent