BDBM39079 1-(3-p-Tolyl-isothiazolo[4,5-d]pyrimidin-7-yl)-piperidine-4-carboxylic acid amide::1-[3-(4-methylphenyl)-7-isothiazolo[4,5-d]pyrimidinyl]-4-piperidinecarboxamide::1-[3-(4-methylphenyl)-[1,2]thiazolo[4,5-d]pyrimidin-7-yl]piperidine-4-carboxamide::1-[3-(p-tolyl)isothiazolo[4,5-d]pyrimidin-7-yl]isonipecotamide::MLS000074750::SMR000006422::cid_650679
SMILES Cc1ccc(cc1)-c1nsc2c(ncnc12)N1CCC(CC1)C(N)=O
InChI Key InChIKey=HSELHXUKEXLCIN-UHFFFAOYSA-N
Data  3 IC50
  Tab Delimited (TSV)   2D SDfile   Computed 3D by Vconf -m prep SDfile
Find this compound or compounds like it in BindingDB:
Activity Spreadsheet -- Enzyme Inhibition Constant Data from BindingDB
Found 3 hits for monomerid = 39079
TargetIsoform 2 of Nuclear receptor ROR-alpha (Alpha-2)(Homo sapiens (Human))
The Scripps Research Institute Molecular Screening Center
Curated by PubChem BioAssay
LigandPNGBDBM39079(1-(3-p-Tolyl-isothiazolo[4,5-d]pyrimidin-7-yl)-pip...)
Affinity DataIC50:  1.07E+3nM. Assay description: Source (MLSCN Center Name): The Scripps Research Institute Molecular Screening Center Center Affiliation: The Scripps Research Institute, TSRI Assay ...
In DepthDetails PCBioAssay
TargetSteroidogenic factor 1(Homo sapiens (Human))
The Scripps Research Institute Molecular Screening Center
Curated by PubChem BioAssay
LigandPNGBDBM39079(1-(3-p-Tolyl-isothiazolo[4,5-d]pyrimidin-7-yl)-pip...)
Affinity DataIC50:  221nM. Assay description: Source (MLSCN Center Name): The Scripps Research Institute Molecular Screening Center Center Affiliation: The Scripps Research Institute, TSRI Assay ...
In DepthDetails PCBioAssay
TargetSteroidogenic factor 1(Homo sapiens (Human))
The Scripps Research Institute Molecular Screening Center
Curated by PubChem BioAssay
LigandPNGBDBM39079(1-(3-p-Tolyl-isothiazolo[4,5-d]pyrimidin-7-yl)-pip...)
Affinity DataIC50:  1.53E+3nM. Assay description: Source (MLSCN Center Name): The Scripps Research Institute Molecular Screening Center Center Affiliation: The Scripps Research Institute, TSRI Assay ...
In DepthDetails PCBioAssay