BDBM391642 US10300048, ETI-T-198
SMILES COc1cc(\C=C2/S\C(=N/c3ccccc3)N(Cc3ccco3)C2=O)cc(CC=C)c1O
InChI Key InChIKey=YSLXPAUGCBPIFW-GZAOZUBMSA-N
Data  1 IC50
  Tab Delimited (TSV)   2D SDfile   Computed 3D by Vconf -m prep SDfile
Find this compound or compounds like it in BindingDB:
Activity Spreadsheet -- Enzyme Inhibition Constant Data from BindingDB
Found 1 hit for monomerid = 391642
TargetFatty-acid amide hydrolase 1(Homo sapiens (Human))
Universitat Bern
US Patent
LigandPNGBDBM391642(US10300048, ETI-T-198)
Affinity DataIC50:  661nM. Assay description: Screening for AEA cellular uptake inhibition was performed in a semi-automated procedure: Pipetting and washing steps were performed by a Biomek3000 ...
In DepthDetails US Patent