BDBM391658 (1-(Methylsulfonyl)-4-{[(trans-2-phenylcyclopropyl)amino]methyl}piperidin-4-yl)acetonitrile::US10300051, Example 4
SMILES CS(=O)(=O)N1CCC(CNC2CC2c2ccccc2)(CC#N)CC1
InChI Key InChIKey=NFIRZTNIUGSSEX-UHFFFAOYSA-N
Data  1 IC50
  Tab Delimited (TSV)   2D SDfile   Computed 3D by Vconf -m prep SDfile
Find this compound or compounds like it in BindingDB:
Activity Spreadsheet -- Enzyme Inhibition Constant Data from BindingDB
Found 1 hit for monomerid = 391658
TargetLysine-specific histone demethylase 1A(Homo sapiens (Human))
Incyte
US Patent
LigandPNGBDBM391658((1-(Methylsulfonyl)-4-{[(trans-2-phenylcyclopropyl...)
Affinity DataIC50: <100nM. Assay description: LANCE LSD1/KDM1A demethylase assay—10 μL of 1 nM LSD-1 enzyme (ENZO BML-SE544-0050) in the assay buffer (50 mM Tris, pH 7.5, 0.01% Tween-20, 25 ...
Ligand InfoPC cidPC sid
In DepthDetails US Patent