BDBM391687 3-{[4-({[(1R,2S)-2-phenylcyclopropyl]amino}methyl)-1-(pyridin-3-ylmethyl)piperidin-4-yl]methyl}benzoic Acid::US10300051, Example 33
SMILES OC(=O)c1cccc(CC2(CN[C@@H]3CC3c3ccccc3)CCN(Cc3cccnc3)CC2)c1
InChI Key InChIKey=WIYTWAIRNMFVOT-SSYAZFEXSA-N
Data  1 IC50
  Tab Delimited (TSV)   2D SDfile   Computed 3D by Vconf -m prep SDfile
Find this compound or compounds like it in BindingDB:
Activity Spreadsheet -- Enzyme Inhibition Constant Data from BindingDB
Found 1 hit for monomerid = 391687
TargetLysine-specific histone demethylase 1A(Homo sapiens (Human))
Incyte
US Patent
LigandPNGBDBM391687(3-{[4-({[(1R,2S)-2-phenylcyclopropyl]amino}methyl)...)
Affinity DataIC50: <100nM. Assay description: LANCE LSD1/KDM1A demethylase assay—10 μL of 1 nM LSD-1 enzyme (ENZO BML-SE544-0050) in the assay buffer (50 mM Tris, pH 7.5, 0.01% Tween-20, 25 ...
Ligand InfoPC cidPC sid
In DepthDetails US Patent