BDBM39180 3-chloranyl-1-(6-chloranylpyridin-3-yl)-4-(4-ethylpiperazin-1-yl)pyrrole-2,5-dione::3-chloro-1-(6-chloro-3-pyridinyl)-4-(4-ethyl-1-piperazinyl)pyrrole-2,5-dione::3-chloro-1-(6-chloro-3-pyridyl)-4-(4-ethylpiperazino)-3-pyrroline-2,5-quinone::3-chloro-1-(6-chloropyridin-3-yl)-4-(4-ethylpiperazin-1-yl)pyrrole-2,5-dione::MLS-0111755.0001::cid_16654781
SMILES CCN1CCN(CC1)C1=C(Cl)C(=O)N(C1=O)c1ccc(Cl)nc1
InChI Key InChIKey=KCQIPBBUUQQWMH-UHFFFAOYSA-N
Data  2 IC50
  Tab Delimited (TSV)   2D SDfile   Computed 3D by Vconf -m prep SDfile
Find this compound or compounds like it in BindingDB:
Activity Spreadsheet -- Enzyme Inhibition Constant Data from BindingDB
Found 2 hits for monomerid = 39180
TargetBcl-2-related protein A1(Mus musculus (Mouse))
Sanford-Burnham Center For Chemical Genomics
Curated by PubChem BioAssay
LigandPNGBDBM39180(3-chloranyl-1-(6-chloranylpyridin-3-yl)-4-(4-ethyl...)
Affinity DataIC50:  2.08E+4nM. Assay description: Sanford-Burnham Center for Chemical Genomics (SBCCG) Sanford-Burnham Medical Research Institute (San Diego, CA) NIH Molecular Libraries Screening Cen...
In DepthDetails PCBioAssay
TargetBcl-2-related protein A1(Mus musculus (Mouse))
Sanford-Burnham Center For Chemical Genomics
Curated by PubChem BioAssay
LigandPNGBDBM39180(3-chloranyl-1-(6-chloranylpyridin-3-yl)-4-(4-ethyl...)
Affinity DataIC50:  1.50E+4nM. Assay description: Data Source: Sanford-Burnham Center for Chemical Genomics (SBCCG) Source Affiliation: Sanford-Burnham Medical Research Institute (SBMRI, San Diego, C...
In DepthDetails PCBioAssay