BDBM391832 US10300074, Compd 27
SMILES CN[C@@H](C)C(=O)N[C@H]1CCO[C@@H]2N(C(C(=O)N[C@@H]3CCCc4ccccc34)c3ccccc23)C1=O
InChI Key InChIKey=SRRKQOXMYDWYGT-MVCZWWRHSA-N
Data  3 KI
  Tab Delimited (TSV)   2D SDfile   Computed 3D by Vconf -m prep SDfile
Find this compound or compounds like it in BindingDB:
Activity Spreadsheet -- Enzyme Inhibition Constant Data from BindingDB
Found 3 hits for monomerid = 391832
TargetE3 ubiquitin-protein ligase XIAP [241-356](Homo sapiens (Human))
Sanford Burnham Prebys Medical Discovery Institute
US Patent
LigandPNGBDBM391832(US10300074, Compd 27)
Affinity DataKi: <2.50E+4nM. Assay description: 5000 PPC-1 cells were plated and grown overnight. Compounds were plated and 4 hrs later, TRAIL was added to half of the plate while RPMI was added to...
Ligand InfoPC cidPC sid
In DepthDetails US Patent
TargetBaculoviral IAP repeat-containing protein 7(Homo sapiens (Human))
Sanford Burnham Prebys Medical Discovery Institute
US Patent
LigandPNGBDBM391832(US10300074, Compd 27)
Affinity DataKi: <2.50E+4nM. Assay description: 5000 PPC-1 cells were plated and grown overnight. Compounds were plated and 4 hrs later, TRAIL was added to half of the plate while RPMI was added to...
Ligand InfoPC cidPC sid
In DepthDetails US Patent
TargetE3 ubiquitin-protein ligase XIAP [1-168]/[124-242](Homo sapiens (Human))
Sanford Burnham Prebys Medical Discovery Institute
US Patent
LigandPNGBDBM391832(US10300074, Compd 27)
Affinity DataKi: >5.00E+4nM. Assay description: 5000 PPC-1 cells were plated and grown overnight. Compounds were plated and 4 hrs later, TRAIL was added to half of the plate while RPMI was added to...
Ligand InfoPC cidPC sid
In DepthDetails US Patent