BDBM391976 US10301269, Number 21::US10800744, Number 21::{2-[1-({[4- (Trifluoromethyl)phenyl] carbamoyl} amino)propyl]-1H- imidazol-1-yl}acetic acid
SMILES CCC(NC(=O)Nc1ccc(cc1)C(F)(F)F)c1nccn1CC(O)=O
InChI Key InChIKey=JEEIEWDSHNSLCF-UHFFFAOYSA-N
Data  2 EC50
  Tab Delimited (TSV)   2D SDfile   Computed 3D by Vconf -m prep SDfile
Find this compound or compounds like it in BindingDB:
Activity Spreadsheet -- Enzyme Inhibition Constant Data from BindingDB
Found 2 hits for monomerid = 391976
TargetN-formyl peptide receptor 2(Homo sapiens (Human))
Allergan
US Patent
LigandPNGBDBM391976(US10301269, Number 21 | US10800744, Number 21 | {2...)
Affinity DataEC50:  6.60nM. Assay description: Biological activity of compounds according to Formula I is set forth in Table 7 below. CHO-Gα16 cells stably expressing FPR2 were cultured in (F...
Ligand InfoPC cidPC sid
In DepthDetails US Patent
TargetN-formyl peptide receptor 2(Homo sapiens (Human))
Allergan
US Patent
LigandPNGBDBM391976(US10301269, Number 21 | US10800744, Number 21 | {2...)
Affinity DataEC50:  6.60nM. Assay description: Biological activity of compounds according to Formula I is set forth in Table 7 below. CHO-Gα16 cells stably expressing FPR2 were cultured in (F...
Ligand InfoPC cidPC sid
In DepthDetails US Patent