BDBM3920 1-phenyl-5-(propan-2-yloxy)-1H-1,3-benzodiazole::5-Isopropoxy-1-phenylbenzimidazole Hydrochloride::5-Substituted 1-Phenylbenzimidazole 9
SMILES CC(C)Oc1ccc2n(cnc2c1)-c1ccccc1
InChI Key InChIKey=UGIHFRMZCNGEMK-UHFFFAOYSA-N
Data  3 IC50
  Tab Delimited (TSV)   2D SDfile   Computed 3D by Vconf -m prep SDfile
Find this compound or compounds like it in BindingDB:
Activity Spreadsheet -- Enzyme Inhibition Constant Data from BindingDB
Found 3 hits for monomerid = 3920
TargetPlatelet-derived growth factor receptor beta(Homo sapiens (Human))
University Of Auckland
LigandPNGBDBM3920(1-phenyl-5-(propan-2-yloxy)-1H-1,3-benzodiazole | ...)
Affinity DataIC50:  3.10E+3nMpH: 7.4 T: 2°C. Assay description: IC50 is the inhibitor concentration which inhibits 50% of kinase activity that catalyzes the transfer of the terminal phosphate from [gamma-32P] labe...
In DepthDetails ArticlePubMed
TargetProto-oncogene tyrosine-protein kinase Src(Homo sapiens (Human))
University Of Auckland
LigandPNGBDBM3920(1-phenyl-5-(propan-2-yloxy)-1H-1,3-benzodiazole | ...)
Affinity DataIC50: >5.00E+4nM. Assay description: IC50 is the inhibitor concentration which inhibits 50% of kinase activity that catalyzes the transfer of the terminal phosphate from [gamma-32P] labe...
In DepthDetails ArticlePubMed
TargetFibroblast growth factor receptor 1(Homo sapiens (Human))
University Of Auckland
LigandPNGBDBM3920(1-phenyl-5-(propan-2-yloxy)-1H-1,3-benzodiazole | ...)
Affinity DataIC50:  5.00E+4nM. Assay description: IC50 is the inhibitor concentration which inhibits 50% of kinase activity that catalyzes the transfer of the terminal phosphate from [gamma-32P] labe...
In DepthDetails ArticlePubMed