BDBM392008 US10301272, Example 6/6
SMILES CC(C)(C)NS(=O)(=O)c1ccc(-c2sc(nc2CC2CCCCC2)C(=O)NC2CCS(=O)(=O)CC2)c2ccccc12
InChI Key InChIKey=TWURQQLYKYCGLR-UHFFFAOYSA-N
Data  3 IC50
  Tab Delimited (TSV)   2D SDfile   Computed 3D by Vconf -m prep SDfile
Find this compound or compounds like it in BindingDB:
Activity Spreadsheet -- Enzyme Inhibition Constant Data from BindingDB
Found 3 hits for monomerid = 392008
TargetIsoform 2 of Nuclear receptor ROR-gamma (RORgT)(Homo sapiens (Human))
Phenex Pharmaceuticals
US Patent
LigandPNGBDBM392008(US10301272, Example 6/6)
Affinity DataIC50:  200nM. Assay description: Determination of a ligand mediated Gal4 promoter driven transactivation to quantify ligand binding to RORγ was performed as follows: DNA encodin...
Ligand InfoPC cidPC sid
In DepthDetails US Patent
TargetIsoform 2 of Nuclear receptor ROR-gamma (RORgT)(Homo sapiens (Human))
Phenex Pharmaceuticals
US Patent
LigandPNGBDBM392008(US10301272, Example 6/6)
Affinity DataIC50:  1nM. Assay description: Cells were incubated for additional 16 h before renilla (REN) luciferase activities were measured sequentially in the same cell extract using a Dual-...
Ligand InfoPC cidPC sid
In DepthDetails US Patent
TargetIsoform 2 of Nuclear receptor ROR-gamma (RORgT)(Homo sapiens (Human))
Phenex Pharmaceuticals
US Patent
LigandPNGBDBM392008(US10301272, Example 6/6)
Affinity DataIC50:  1nM. Assay description: Cells were incubated for additional 16 h before firefly (FF) luciferase activities were measured sequentially in the same cell extract using a Dual-L...
Ligand InfoPC cidPC sid
In DepthDetails US Patent