BDBM392719 Example 13::US10301291, Compound 12a
SMILES CC(O)CNc1nccc(n1)-n1c(CC#N)cnc1-c1ccc2OCOc2c1
InChI Key InChIKey=KBMVXTJPDJPUCK-UHFFFAOYSA-N
Data  1 IC50
  Tab Delimited (TSV)   2D SDfile   Computed 3D by Vconf -m prep SDfile
Find this compound or compounds like it in BindingDB:
Activity Spreadsheet -- Enzyme Inhibition Constant Data from BindingDB
Found 1 hit for monomerid = 392719
TargetMitogen-activated protein kinase 10(Homo sapiens (Human))
Samjin Pharmaceutical
US Patent
LigandPNGBDBM392719(Example 13 | US10301291, Compound 12a)
Affinity DataIC50:  65nM. Assay description: First of all, after a substrate was inserted into a prepared base reaction buffer solution (20 mM Hepes (pH 75), 10 mM MgCl2, 1 mM EGTA, 0.02% Brij35...
Ligand InfoPC cidPC sid
In DepthDetails US Patent