BDBM392796 5-[[(2R)-1-methylpyrrolidin-2-yl]methoxy]-7-(1-tetrahydropyran-3-ylbenzimidazol-5-yl)-3H-benzimidazole-4-carboxamide methanesulfonic acid salt::US10301305, Example 215
SMILES CN1CCC[C@@H]1COc1cc(-c2ccc3n(cnc3c2)C2CCCOC2)c2nc[nH]c2c1C(N)=O
InChI Key
Data  4 IC50
  Tab Delimited (TSV)   2D SDfile   Computed 3D by Vconf -m prep SDfile
Find this compound or compounds like it in BindingDB:
Activity Spreadsheet -- Enzyme Inhibition Constant Data from BindingDB
Found 4 hits for monomerid = 392796
TargetPutative glyoxylate/hydroxypyruvate reductase B(Staphylococcus aureus (strain SA113))
Mutabilis
US Patent
LigandPNGBDBM392796(5-[[(2R)-1-methylpyrrolidin-2-yl]methoxy]-7-(1-tet...)
Affinity DataIC50:  0.800nM. Assay description: The assay buffer “AB” contained 50 mM Hepes pH8.0, 10 mM MgCl2, 50 mM KCl, 0.012% Triton-X100, 10 mM DTT and 100 nM Myelin-basic protein. The followi...
Ligand InfoPC cidPC sid
In DepthDetails US Patent
TargetD-alanine--D-alanyl carrier protein ligase(Streptococcus agalactiae serotype V (strain ATCC B...)
Mutabilis
US Patent
LigandPNGBDBM392796(5-[[(2R)-1-methylpyrrolidin-2-yl]methoxy]-7-(1-tet...)
Affinity DataIC50:  86nM. Assay description: The assay buffer “AB” contained 50 mM Hepes pH8.0, 10 mM MgCl2, 50 mM KCl, 0.012% Triton-X100, 10 mM DTT and 100 nM Myelin-basic protein. The followi...
Ligand InfoPC cidPC sid
In DepthDetails US Patent
TargetD-alanine--D-alanyl carrier protein ligase(Enterococcus faecium E1679)
Mutabilis
US Patent
LigandPNGBDBM392796(5-[[(2R)-1-methylpyrrolidin-2-yl]methoxy]-7-(1-tet...)
Affinity DataIC50:  5.70nM. Assay description: The assay buffer “AB” contained 50 mM Hepes pH8.0, 10 mM MgCl2, 50 mM KCl, 0.012% Triton-X100, 10 mM DTT and 100 nM Myelin-basic protein. The followi...
Ligand InfoPC cidPC sid
In DepthDetails US Patent
TargetD-alanine--D-alanyl carrier protein ligase(Enterococcus faecalis (strain ATCC 700802 / V583))
Mutabilis
US Patent
LigandPNGBDBM392796(5-[[(2R)-1-methylpyrrolidin-2-yl]methoxy]-7-(1-tet...)
Affinity DataIC50:  1.40nM. Assay description: The assay buffer “AB” contained 50 mM Hepes pH8.0, 10 mM MgCl2, 50 mM KCl, 0.012% Triton-X100, 10 mM DTT and 100 nM Myelin-basic protein. The followi...
Ligand InfoPC cidPC sid
In DepthDetails US Patent