BDBM392807 3-([1,1′-Biphenyl]-3-yl)-2-(pyridin-4-yl)-1-((tetrahydro-2H-pyran-4-yl)methyl)-6,7-dihydro-1H-pyrrolo[3,2-c]pyridin-4(5H)-one::US10301306, Example 5
SMILES O=C1NCCc2c1c(c(-c1ccncc1)n2CC1CCOCC1)-c1cccc(c1)-c1ccccc1
InChI Key InChIKey=TWHFGBJBDJVELX-UHFFFAOYSA-N
Data  1 IC50
  Tab Delimited (TSV)   2D SDfile   Computed 3D by Vconf -m prep SDfile
Find this compound or compounds like it in BindingDB:
Activity Spreadsheet -- Enzyme Inhibition Constant Data from BindingDB
Found 1 hit for monomerid = 392807
TargetReceptor-interacting serine/threonine-protein kinase 3(Homo sapiens (Human))
Bristol-Myers Squibb
US Patent
LigandPNGBDBM392807(3-([1,1′-Biphenyl]-3-yl)-2-(pyridin-4-yl)-1-...)
Affinity DataIC50:  7.55E+3nM. Assay description: The assays were performed in black 1536-well plates. The final assay volume of 2 μl contained a mixture of a fluorescently labeled HTRF probe, T...
Ligand InfoPC cidPC sid
In DepthDetails US Patent