BDBM392851 US10301306, Example 49
SMILES Fc1ccc(cc1)-c1c2c(CCNC2=O)n(CC#N)c1-c1ccncc1
InChI Key InChIKey=WCOPITBFHQLJHL-UHFFFAOYSA-N
Data  1 IC50
  Tab Delimited (TSV)   2D SDfile   Computed 3D by Vconf -m prep SDfile
Find this compound or compounds like it in BindingDB:
Activity Spreadsheet -- Enzyme Inhibition Constant Data from BindingDB
Found 1 hit for monomerid = 392851
TargetReceptor-interacting serine/threonine-protein kinase 3(Homo sapiens (Human))
Bristol-Myers Squibb
US Patent
LigandPNGBDBM392851(US10301306, Example 49)
Affinity DataIC50:  7.55E+3nM. Assay description: The assays were performed in black 1536-well plates. The final assay volume of 2 μl contained a mixture of a fluorescently labeled HTRF probe, T...
Ligand InfoPC cidPC sid
In DepthDetails US Patent