BDBM39290 MLS000118826::N-(4-pyridyl)-1-(8-quinolylsulfonyl)nipecotamide::N-pyridin-4-yl-1-(8-quinolinylsulfonyl)-3-piperidinecarboxamide::N-pyridin-4-yl-1-quinolin-8-ylsulfonyl-piperidine-3-carboxamide::N-pyridin-4-yl-1-quinolin-8-ylsulfonylpiperidine-3-carboxamide::SMR000095766::cid_5307388
SMILES O=C(Nc1ccncc1)C1CCCN(C1)S(=O)(=O)c1cccc2cccnc12
InChI Key InChIKey=LWVIUOVTDNHULR-UHFFFAOYSA-N
Data  1 IC50
  Tab Delimited (TSV)   2D SDfile   Computed 3D by Vconf -m prep SDfile
Find this compound or compounds like it in BindingDB:
Activity Spreadsheet -- Enzyme Inhibition Constant Data from BindingDB
Found 1 hit for monomerid = 39290
TargetRho-associated protein kinase 2(Homo sapiens (Human))
The Scripps Research Institute Molecular Screening Center
Curated by PubChem BioAssay
LigandPNGBDBM39290(MLS000118826 | N-(4-pyridyl)-1-(8-quinolylsulfonyl...)
Affinity DataIC50:  1.73E+3nM. Assay description: Source (MLSCN Center Name): The Scripps Research Institute Molecular Screening Center Center Affiliation: The Scripps Research Institute, TSRI Assay ...
In DepthDetails PCBioAssay