BDBM392958 N-(4-(1-(2-Fluoro-4-(trifluoromethyl)benzyl)-3-(4-fluorophenyl)-4-oxo-4,5-dihydro-1H-pyrrolo[3,2-c]pyridin-2-yl)pyridin-2-yl)propionamide::US10301306, Example 156
SMILES CCC(=O)Nc1cc(ccn1)-c1c(-c2ccc(F)cc2)c2c(cc[nH]c2=O)n1Cc1ccc(cc1F)C(F)(F)F
InChI Key InChIKey=NGQYKHWSKXUEOI-UHFFFAOYSA-N
Data  1 IC50
  Tab Delimited (TSV)   2D SDfile   Computed 3D by Vconf -m prep SDfile
Find this compound or compounds like it in BindingDB:
Activity Spreadsheet -- Enzyme Inhibition Constant Data from BindingDB
Found 1 hit for monomerid = 392958
TargetReceptor-interacting serine/threonine-protein kinase 3(Homo sapiens (Human))
Bristol-Myers Squibb
US Patent
LigandPNGBDBM392958(N-(4-(1-(2-Fluoro-4-(trifluoromethyl)benzyl)-3-(4-...)
Affinity DataIC50: <30nM. Assay description: The assays were performed in black 1536-well plates. The final assay volume of 2 μl contained a mixture of a fluorescently labeled HTRF probe, T...
Ligand InfoPC cidPC sid
In DepthDetails US Patent