BDBM392987 US10301306, Example 185++
SMILES Cc1cc(Cn2c3CCNC(=O)c3c(c2-c2ccnc(NC(=O)C3CC3)c2)-c2cccc(NC(=O)OC(C)(C)C)c2)n(C)n1
InChI Key InChIKey=UZGUGCZIGYMGDX-UHFFFAOYSA-N
Data  1 IC50
  Tab Delimited (TSV)   2D SDfile   Computed 3D by Vconf -m prep SDfile
Find this compound or compounds like it in BindingDB:
Activity Spreadsheet -- Enzyme Inhibition Constant Data from BindingDB
Found 1 hit for monomerid = 392987
TargetReceptor-interacting serine/threonine-protein kinase 3(Homo sapiens (Human))
Bristol-Myers Squibb
US Patent
LigandPNGBDBM392987(US10301306, Example 185++)
Affinity DataIC50:  7.55E+3nM. Assay description: The assays were performed in black 1536-well plates. The final assay volume of 2 μl contained a mixture of a fluorescently labeled HTRF probe, T...
Ligand InfoPC cidPC sid
In DepthDetails US Patent