BDBM393019 2-butoxy-7-(4-(1-methylpiperidine-4-yl)benzyl)-5H-pyrrolo[3,2-d]pyrimidine-4-amine::US9962388, Compound Example 25
SMILES CCCCOc1nc(N)c2[nH]cc(Cc3ccc(cc3)C3CCN(C)CC3)c2n1
InChI Key InChIKey=IZBMFTOYMZRQPK-UHFFFAOYSA-N
Data  1 EC50
  Tab Delimited (TSV)   2D SDfile   Computed 3D by Vconf -m prep SDfile
Find this compound or compounds like it in BindingDB:
Activity Spreadsheet -- Enzyme Inhibition Constant Data from BindingDB
Found 1 hit for monomerid = 393019
TargetToll-like receptor 7(Homo sapiens (Human))
Chia Tai Tianqing Pharmaceutical Group
US Patent
LigandPNGBDBM393019(2-butoxy-7-(4-(1-methylpiperidine-4-yl)benzyl)-5H-...)
Affinity DataEC50:  0.5nM. Assay description: Reagents:HEK-blue hTLR7 cell and HEK-blue hTLR8 cell (available from InvivoGen)DMEM mediumheat inactivated fetal bovine serumAnti Mycoplasma reagent ...
Ligand InfoPC cidPC sid
In DepthDetails US Patent