BDBM393023 2-butoxy-7-((2-methyl-1,2,3,4-tetrahydroisoquinoline-7-yl)methyl)-5H-pyrrolo[3,2-d]pyrimidine-4-amine::US9962388, Compound Example 29
SMILES CCCCOc1nc(N)c2[nH]cc(Cc3ccc4CCN(C)Cc4c3)c2n1
InChI Key InChIKey=LHUWMIBPEFPNAD-UHFFFAOYSA-N
Data  1 EC50
  Tab Delimited (TSV)   2D SDfile   Computed 3D by Vconf -m prep SDfile
Find this compound or compounds like it in BindingDB:
Activity Spreadsheet -- Enzyme Inhibition Constant Data from BindingDB
Found 1 hit for monomerid = 393023
TargetToll-like receptor 7(Homo sapiens (Human))
Chia Tai Tianqing Pharmaceutical Group
US Patent
LigandPNGBDBM393023(2-butoxy-7-((2-methyl-1,2,3,4-tetrahydroisoquinoli...)
Affinity DataEC50:  5.5nM. Assay description: Reagents:HEK-blue hTLR7 cell and HEK-blue hTLR8 cell (available from InvivoGen)DMEM mediumheat inactivated fetal bovine serumAnti Mycoplasma reagent ...
Ligand InfoPC cidPC sid
In DepthDetails US Patent