BDBM393029 7-benzyl-2-(2-methoxylethoxyl)-5H-pyrrolo[3,2-d]pyrimidine-4-amine::US9962388, Compound Example 35
SMILES COCCOc1nc(N)c2[nH]cc(Cc3ccccc3)c2n1
InChI Key InChIKey=KWNBJQBZWSGSAM-UHFFFAOYSA-N
Data  1 EC50
  Tab Delimited (TSV)   2D SDfile   Computed 3D by Vconf -m prep SDfile
Find this compound or compounds like it in BindingDB:
Activity Spreadsheet -- Enzyme Inhibition Constant Data from BindingDB
Found 1 hit for monomerid = 393029
TargetToll-like receptor 7(Homo sapiens (Human))
Chia Tai Tianqing Pharmaceutical Group
US Patent
LigandPNGBDBM393029(7-benzyl-2-(2-methoxylethoxyl)-5H-pyrrolo[3,2-d]py...)
Affinity DataEC50:  55nM. Assay description: Reagents:HEK-blue hTLR7 cell and HEK-blue hTLR8 cell (available from InvivoGen)DMEM mediumheat inactivated fetal bovine serumAnti Mycoplasma reagent ...
Ligand InfoPC cidPC sid
In DepthDetails US Patent