BDBM393039 4-amino-2-butoxy-7-(4-(pyrrolidine-1-ylmethyl)benzyl)-5H-pyrrolo[3,2-d]pyrimidine-6-formamide::US9962388, Compound Example 45
SMILES CCCCOc1nc(N)c2[nH]c(C(N)=O)c(Cc3ccc(CN4CCCC4)cc3)c2n1
InChI Key InChIKey=CGCGBSJNVPLQOV-UHFFFAOYSA-N
Data  1 EC50
  Tab Delimited (TSV)   2D SDfile   Computed 3D by Vconf -m prep SDfile
Find this compound or compounds like it in BindingDB:
Activity Spreadsheet -- Enzyme Inhibition Constant Data from BindingDB
Found 1 hit for monomerid = 393039
TargetToll-like receptor 7(Homo sapiens (Human))
Chia Tai Tianqing Pharmaceutical Group
US Patent
LigandPNGBDBM393039(4-amino-2-butoxy-7-(4-(pyrrolidine-1-ylmethyl)benz...)
Affinity DataEC50:  5.5nM. Assay description: Reagents:HEK-blue hTLR7 cell and HEK-blue hTLR8 cell (available from InvivoGen)DMEM mediumheat inactivated fetal bovine serumAnti Mycoplasma reagent ...
Ligand InfoPC cidPC sid
In DepthDetails US Patent