BDBM393184 US10301317, Example 197
SMILES CC(N1Cc2cc3c(n[nH]c3cc2NC1=O)-c1ccnc(C)c1)c1ccc(F)cc1
InChI Key
Data  1 IC50
  Tab Delimited (TSV)   2D SDfile   Computed 3D by Vconf -m prep SDfile
Find this compound or compounds like it in BindingDB:
Activity Spreadsheet -- Enzyme Inhibition Constant Data from BindingDB
Found 1 hit for monomerid = 393184
TargetMitogen-activated protein kinase 1(Homo sapiens (Human))
Kura Oncology
US Patent
LigandPNGBDBM393184(US10301317, Example 197)
Affinity DataIC50: <50nM. Assay description: The inhibition of ERK activity by the compounds disclosed herein was determined using the Z′-LYTE kinase assay kit (Life Technologies) with a S...
Ligand InfoPC cidPC sid
In DepthDetails US Patent