BDBM393318 (11-Isothiocyanatoundecyl)benzene::US9963444, Example 21
SMILES S=C=NCCCCCCCCCCCc1ccccc1
InChI Key InChIKey=UCPGXCXDWSFGRH-UHFFFAOYSA-N
Data  1 IC50
  Tab Delimited (TSV)   2D SDfile   Computed 3D by Vconf -m prep SDfile
Find this compound or compounds like it in BindingDB:
Activity Spreadsheet -- Enzyme Inhibition Constant Data from BindingDB
Found 1 hit for monomerid = 393318
TargetN-acylethanolamine-hydrolyzing acid amidase(Homo sapiens (Human))
Northeastern University
US Patent
LigandPNGBDBM393318((11-Isothiocyanatoundecyl)benzene | US9963444, Exa...)
Affinity DataIC50:  55nM. Assay description: In order to have an assay method more conducive to high-throughput screening than those published for measuring the NAE hydrolyzing activity of NAAA,...
Ligand InfoPC cidPC sid
In DepthDetails US Patent