BDBM393446 1-(3,4- dihydro- pyrazino[1,2- a]indol- 2(1H)-yl)-2- (piperidin-1- yl)ethanone hydrochloride::US9963453, 5
SMILES O=C(CN1CCCCC1)N1CCn2c(C1)cc1ccccc21
InChI Key InChIKey=BLRIDWZEWMVRHO-UHFFFAOYSA-N
Data  1 KI
  Tab Delimited (TSV)   2D SDfile   Computed 3D by Vconf -m prep SDfile
Find this compound or compounds like it in BindingDB:
Activity Spreadsheet -- Enzyme Inhibition Constant Data from BindingDB
Found 1 hit for monomerid = 393446
TargetSigma non-opioid intracellular receptor 1(Homo sapiens (Human))
Laboratorios Del Dr. Esteve
US Patent
LigandPNGBDBM393446(1-(3,4- dihydro- pyrazino[1,2- a]indol- 2(1H)-yl)-...)
Affinity DataKi:  39.8nM. Assay description: To investigate binding properties of sigma 1 receptor ligands to human sigma 1 receptor, transfected HEK-293 membranes and [3H](+)-pentazocine (Perki...
Ligand InfoPC cidPC sid
In DepthDetails US Patent