BDBM393498 US9969687, Compound 82
SMILES CC(C)(C)c1ccc(cc1)S(=O)(=O)Nc1ccc(C#N)c2C(=O)N(Cc3cccnc3)C(=O)c12
InChI Key InChIKey=WABKHGUEMLWJDV-UHFFFAOYSA-N
Data  2 KI
  Tab Delimited (TSV)   2D SDfile   Computed 3D by Vconf -m prep SDfile
Find this compound or compounds like it in BindingDB:
Activity Spreadsheet -- Enzyme Inhibition Constant Data from BindingDB
Found 2 hits for monomerid = 393498
TargetC-C chemokine receptor type 9(Homo sapiens (Human))
Norgine
Curated by ChEMBL
LigandPNGBDBM393498(US9969687, Compound 82)
Affinity DataKi:  19nM. Assay description: Antagonist activity at CCR9 receptor in human MOLT4 cells assessed as inhibition of CCL25-induced increase in intracellular calcium level preincubate...
Ligand InfoPC cidPC sid
In DepthDetails ArticlePubMed
TargetC-C chemokine receptor type 9(Homo sapiens (Human))
Norgine
Curated by ChEMBL
LigandPNGBDBM393498(US9969687, Compound 82)
Affinity DataKi:  98nM. Assay description: A calcium flux assay was used to determine the ability of the compounds to interfere with the binding between CCR9 and its chemokine ligand (TECK) in...
Ligand InfoPC cidPC sid
In DepthDetails US Patent